{"text_format":"1","workbook":"xlsx","n_sheets":9,"sheets":["Form","Instructions","Inputs","Sheet1","Per Diem","Allowable Claim Items","Cost Centre","Expense Code","Follow-up"],"not_rendered":{"charts":0,"images":3,"macros":1,"external_links":0,"defined_names":9,"comments":1,"pivot_tables":0},"unopened":[],"bounds":{"document_bytes":16777216,"sheet_cells":100000,"rows_first":2000,"rows_last":500,"rows_between":2000,"halvings":0,"cell_chars":16384,"cell_head_chars":4096},"cells_cut":0,"cells_raw":0,"read":"whole","date_system":"1900"}

{"sheet":"Form","index":0,"n_rows":201,"n_cols":14,"rows_kept":201,"cut":false,"hidden":false,"merged":[[28,6,28,7],[29,6,29,7],[30,6,30,7],[31,6,31,7],[32,6,32,7],[23,6,23,7],[24,6,24,7],[25,6,25,7],[26,6,26,7],[27,6,27,7],[18,6,18,7],[19,6,19,7],[20,6,20,7],[21,6,21,7],[22,6,22,7],[1,2,1,13],[36,6,36,8],[3,1,3,13],[36,10,37,10],[36,11,37,11],[8,1,8,3],[23,4,23,5],[8,4,8,5],[9,4,9,5],[8,6,8,8],[26,4,26,5],[16,1,17,1],[11,1,11,3],[11,4,11,6],[11,7,11,9],[9,1,9,3],[58,5,59,5],[36,1,37,1],[36,3,37,3],[36,4,36,5],[25,4,25,5],[18,4,18,5],[19,4,19,5],[20,4,20,5],[36,2,37,2],[28,4,28,5],[10,1,10,3],[10,4,10,6],[10,7,10,9],[9,6,9,8],[9,9,9,10],[7,1,7,2],[8,9,8,10],[8,11,8,13],[9,11,9,13],[24,4,24,5],[13,6,13,13],[16,2,17,2],[16,3,17,3],[16,9,17,9],[16,11,17,11],[16,10,17,10],[16,13,17,13],[16,12,17,12],[14,6,14,9],[10,10,10,11],[10,12,10,13],[93,1,94,1],[93,2,94,2],[58,1,59,1],[78,8,79,8],[78,5,79,5],[89,4,89,5],[58,3,59,3],[58,2,59,2],[78,7,79,7],[58,7,59,7],[58,6,59,6],[58,4,59,4],[78,6,79,6],[78,2,79,2],[78,1,79,1],[78,3,79,3],[11,12,11,13],[93,6,94,6],[36,9,37,9],[16,4,16,7],[17,4,17,5],[17,6,17,7],[27,4,27,5],[22,4,22,5],[29,4,29,5],[30,4,30,5],[31,4,31,5],[32,4,32,5],[21,4,21,5],[13,3,13,4],[11,10,11,11],[78,4,79,4]]}
[]
[null,null,"Provincial Travel Nurse Team (PTNT) - Mileage, Parking and Other Expense Claim Form"]
[]
[null,"Mileage and Parking reimbursements for employees are paid via Electronic Funds Transfer to the same bank account as their payroll deposits"]
[]
[null,null,null,"Start Date","End Date"]
[null,null,null,"(MM/DD/YY)","(MM/DD/YY)"]
[null,"Travel Dates"]
[null,"Program",null,null,"Email Address \nIf no email address is provided, you WILL NOT receive notification of payment",null,"Name ",null,null,"Employee Number",null,"Position"]
[null,"Provincial Travel Nurse Team"]
[null,"Complete Home Address\nIncluding City/Town & Postal Code",null,null,"Previous Complete Home Address \nProvide if there was a change in address\nIncluding City/Town & Postal Code",null,null,"Employee Signature\nBy typing your name in the field below, you are stating that you are aware of this claim being submitted by you as the Claimant",null,null,"Date Form Filled\n(MM/DD/YY)",null,"Phone #\nXXX-XXX-XXXX"]
[]
[]
[null,null,"TOTAL CLAIM",{"$f":"L34+J54+G90+F75","v":0},null,null,"Please email receipts (can be photo utilizing smallest picture setting on your phone) in chronological order and form to ptntclaims@sharedhealthmb.ca"]
[]
[null,"MILEAGE"]
[null,"Location\n(Pick fr Drop Down List)","Facility Assignment\n(Pick fr Drop Down List)\n*Location must be chosen first*","Date\n(MM/DD/YY)","Trip Information ",null,null,null,"Round Trip","Rate\n","Input Total KM Traveled","Total","Cost Centre","Expense Code"]
[null,null,null,null,"From \n(Home or any other Address)",null,"Destination \n(Home or Assigned Facility)",null,"(Y/N)"]
[null,null,null,null,null,null,null,null,null,{"$f":"IF(ISERROR(VLOOKUP(B19,Inputs!$O$2:$P$7,2,0)),\"\",VLOOKUP(B19,Inputs!$O$2:$P$7,2,0))","v":""},null,{"$f":"IF(ISERROR(K19*J19),\"\",(K19*J19))","v":""},{"$f":"IF(ISERROR(VLOOKUP(C19,'Cost Centre'!$A:$B,2,0)),\"\",VLOOKUP(C19,'Cost Centre'!$A:$B,2,0))","v":""},{"$f":"IF(M19=\"\",\"\",\"562312000\")","v":""}]
[null,null,null,null,null,null,null,null,null,{"$f":"IF(ISERROR(VLOOKUP(B20,Inputs!$O$2:$P$7,2,0)),\"\",VLOOKUP(B20,Inputs!$O$2:$P$7,2,0))","v":""},null,"",{"$f":"IF(ISERROR(VLOOKUP(C20,'Cost Centre'!$A:$B,2,0)),\"\",VLOOKUP(C20,'Cost Centre'!$A:$B,2,0))","v":""},{"$f":"IF(M20=\"\",\"\",\"562312000\")","v":""}]
[null,null,null,null,null,null,null,null,null,{"$f":"IF(ISERROR(VLOOKUP(B21,Inputs!$O$2:$P$7,2,0)),\"\",VLOOKUP(B21,Inputs!$O$2:$P$7,2,0))","v":""},null,"",{"$f":"IF(ISERROR(VLOOKUP(C21,'Cost Centre'!$A:$B,2,0)),\"\",VLOOKUP(C21,'Cost Centre'!$A:$B,2,0))","v":""},""]
[null,null,null,null,null,null,null,null,null,{"$f":"IF(ISERROR(VLOOKUP(B22,Inputs!$O$2:$P$7,2,0)),\"\",VLOOKUP(B22,Inputs!$O$2:$P$7,2,0))","v":""},null,"",{"$f":"IF(ISERROR(VLOOKUP(C22,'Cost Centre'!$A:$B,2,0)),\"\",VLOOKUP(C22,'Cost Centre'!$A:$B,2,0))","v":""},""]
[null,null,null,null,null,null,null,null,null,{"$f":"IF(ISERROR(VLOOKUP(B23,Inputs!$O$2:$P$7,2,0)),\"\",VLOOKUP(B23,Inputs!$O$2:$P$7,2,0))","v":""},null,"",{"$f":"IF(ISERROR(VLOOKUP(C23,'Cost Centre'!$A:$B,2,0)),\"\",VLOOKUP(C23,'Cost Centre'!$A:$B,2,0))","v":""},""]
[null,null,null,null,null,null,null,null,null,{"$f":"IF(ISERROR(VLOOKUP(B24,Inputs!$O$2:$P$7,2,0)),\"\",VLOOKUP(B24,Inputs!$O$2:$P$7,2,0))","v":""},null,"",{"$f":"IF(ISERROR(VLOOKUP(C24,'Cost Centre'!$A:$B,2,0)),\"\",VLOOKUP(C24,'Cost Centre'!$A:$B,2,0))","v":""},""]
[null,null,null,null,null,null,null,null,null,{"$f":"IF(ISERROR(VLOOKUP(B25,Inputs!$O$2:$P$7,2,0)),\"\",VLOOKUP(B25,Inputs!$O$2:$P$7,2,0))","v":""},null,"",{"$f":"IF(ISERROR(VLOOKUP(C25,'Cost Centre'!$A:$B,2,0)),\"\",VLOOKUP(C25,'Cost Centre'!$A:$B,2,0))","v":""},""]
[null,null,null,null,null,null,null,null,null,{"$f":"IF(ISERROR(VLOOKUP(B26,Inputs!$O$2:$P$7,2,0)),\"\",VLOOKUP(B26,Inputs!$O$2:$P$7,2,0))","v":""},null,"",{"$f":"IF(ISERROR(VLOOKUP(C26,'Cost Centre'!$A:$B,2,0)),\"\",VLOOKUP(C26,'Cost Centre'!$A:$B,2,0))","v":""},""]
[null,null,null,null,null,null,null,null,null,{"$f":"IF(ISERROR(VLOOKUP(B27,Inputs!$O$2:$P$7,2,0)),\"\",VLOOKUP(B27,Inputs!$O$2:$P$7,2,0))","v":""},null,"",{"$f":"IF(ISERROR(VLOOKUP(C27,'Cost Centre'!$A:$B,2,0)),\"\",VLOOKUP(C27,'Cost Centre'!$A:$B,2,0))","v":""},""]
[null,null,null,null,null,null,null,null,null,{"$f":"IF(ISERROR(VLOOKUP(B28,Inputs!$O$2:$P$7,2,0)),\"\",VLOOKUP(B28,Inputs!$O$2:$P$7,2,0))","v":""},null,"",{"$f":"IF(ISERROR(VLOOKUP(C28,'Cost Centre'!$A:$B,2,0)),\"\",VLOOKUP(C28,'Cost Centre'!$A:$B,2,0))","v":""},""]
[null,null,null,null,null,null,null,null,null,{"$f":"IF(ISERROR(VLOOKUP(B29,Inputs!$O$2:$P$7,2,0)),\"\",VLOOKUP(B29,Inputs!$O$2:$P$7,2,0))","v":""},null,"",{"$f":"IF(ISERROR(VLOOKUP(C29,'Cost Centre'!$A:$B,2,0)),\"\",VLOOKUP(C29,'Cost Centre'!$A:$B,2,0))","v":""},""]
[null,null,null,null,null,null,null,null,null,{"$f":"IF(ISERROR(VLOOKUP(B30,Inputs!$O$2:$P$7,2,0)),\"\",VLOOKUP(B30,Inputs!$O$2:$P$7,2,0))","v":""},null,"",{"$f":"IF(ISERROR(VLOOKUP(C30,'Cost Centre'!$A:$B,2,0)),\"\",VLOOKUP(C30,'Cost Centre'!$A:$B,2,0))","v":""},""]
[null,null,null,null,null,null,null,null,null,{"$f":"IF(ISERROR(VLOOKUP(B31,Inputs!$O$2:$P$7,2,0)),\"\",VLOOKUP(B31,Inputs!$O$2:$P$7,2,0))","v":""},null,"",{"$f":"IF(ISERROR(VLOOKUP(C31,'Cost Centre'!$A:$B,2,0)),\"\",VLOOKUP(C31,'Cost Centre'!$A:$B,2,0))","v":""},""]
[null,null,null,null,null,null,null,null,null,{"$f":"IF(ISERROR(VLOOKUP(B32,Inputs!$O$2:$P$7,2,0)),\"\",VLOOKUP(B32,Inputs!$O$2:$P$7,2,0))","v":""},null,"",{"$f":"IF(ISERROR(VLOOKUP(C32,'Cost Centre'!$A:$B,2,0)),\"\",VLOOKUP(C32,'Cost Centre'!$A:$B,2,0))","v":""},""]
[null,null,null,null,null,null,null,null,null,{"$f":"IF(ISERROR(VLOOKUP(B33,Inputs!$O$2:$P$7,2,0)),\"\",VLOOKUP(B33,Inputs!$O$2:$P$7,2,0))","v":""},null,"",{"$f":"IF(ISERROR(VLOOKUP(C33,'Cost Centre'!$A:$B,2,0)),\"\",VLOOKUP(C33,'Cost Centre'!$A:$B,2,0))","v":""},""]
[null,null,null,null,null,null,null,null,"Total",null,{"$f":"SUM(K29:K33)","v":0},{"$f":"SUM(L19:L33)","v":0}]
[]
[null,"PER DIEM - TRAVEL DAY ONLY"]
[null,"Location\n(Pick fr Drop Down List)","Facility Assignment\n(Pick fr Drop Down List)\n*Location must be chosen first*","Date\n(MM/DD/YY)","Time Traveled",null,"PLEASE REFER TO TABLE TO FOR RATES BASED ON LOCATION",null,null,"Total","Cost Centre","Expense Code"]
[null,null,null,null,"Departure Time\n(24-hour format)","Arrival Time\n(24-hour format)","Breakfast\n(Pick fr Drop Down List)","Lunch\n(Pick fr Drop Down List)","Dinner\n(Pick fr Drop Down List)"]
[null,null,null,null,null,null,null,null,null,{"$f":"SUM(G39:I39)","v":0},{"$f":"IF(ISERROR(VLOOKUP(C39,'Cost Centre'!$A:$B,2,0)),\"\",VLOOKUP(C39,'Cost Centre'!$A:$B,2,0))","v":""},{"$f":"IF(K39=\"\",\"\",\"562300005\")","v":""}]
[null,null,null,null,null,null,null,null,null,{"$f":"SUM(G40:I40)","v":0},{"$f":"IF(ISERROR(VLOOKUP(C40,'Cost Centre'!$A:$B,2,0)),\"\",VLOOKUP(C40,'Cost Centre'!$A:$B,2,0))","v":""},{"$f":"IF(K40=\"\",\"\",\"562300005\")","v":""}]
{"$rows_left_out":162}
{"sheet":"Instructions","index":1,"n_rows":76,"n_cols":1,"rows_kept":76,"cut":false,"hidden":true,"merged":[]}
["Instructions on How to Complete the Expense Claim Form"]
[]
["Incomplete forms will be returned to employees unprocessed."]
[]
["Who has to complete a Expense Claim Form?"]
["All Shared Health employees requesting reimbursement for expenses incurred while on Shared Health business."]
[]
["Employee information (all must be filled out):"]
["Travel Dates"]
["Email Address"]
["Name"]
["Position"]
["Employee Number "]
["Home Address (check box if it's a new address)"]
["Signature (By typing your name in the above field, you are stating that you are aware of this claim being submitted by you as the Claimant)"]
["Date"]
["Phone #"]
[]
["Note: Employees are required to provide a void cheque for direct deposit with their first claim, no cheques will be issued. If you wish to receive notification of payment you must supply your email address with your void cheque"]
[]
["APPROVAL REQUIRED "]
["Authorized by - Employee’s Manager with signing authority."]
["Date - Date signed by Manager."]
["Authorized Signature - Signature of Manager"]
[]
["MILEAGE SECTION"]
[]
["Location - Choose one location from drop down list"]
[]
["Facility Assignment - Choose one location from drop down list"]
[]
["Date – Date travel took place"]
[]
["Trip Information- ALL mileage for the day should be documented in this column.   Identify starting address (location), each destination traveled to and the reason for the trip. \n If traveling from home to a location other than your base site, home should be the starting address.  Note: travel from home directly to base site should not be listed."]
[]
["Total Trip Km - total number of all kms driven between locations.  "]
[]
["Rate (Auto-populates based on Location chose) - km rate identified in your collective agreement or as per set Corporate kilometer rate for non-union employees. Use the control button to select the appropriate mileage rate."]
[" - Below the 53rd parallel for travel south of Grand Rapids"]
[" - Above the 53rd parallel for travel north of Grand Rapids"]
{"$rows_left_out":37}
{"sheet":"Inputs","index":2,"n_rows":50,"n_cols":20,"rows_kept":50,"cut":false,"hidden":false,"merged":[]}
["SDO",null,"NRHA",null,"IERHA",null,"PMH",null,"PTNT Above 53rd",null,"PTNT Above 53rd",null,"SHSS",null,"Rate",null,null,"Other"]
["NRHA",null,"NR Flin Flon Home Care",null,"IE Ashern Dialysis",null,"PM Benito PCH",null,"SHM - PrvFlPool",null,"SHM - PrvFlPool",null,"SS Portage Cancer Care",null,"IERHA",0.46,null,"Accomondations"]
["IERHA",null,"NR FlinFlon CancerCare",null,"IE Ashern Emergency",null,"PM Birtle Personal Care Home",null,null,null,null,null,"SS Portage Dialysis",null,"PMH",0.46,null,"Airfare"]
["PMH",null,"NR FlinFlon Dialysis",null,"IE Ashern Medicine",null,"PM Brandon Emergency Dept",null,null,null,null,null,"SS Portage Emergency Depart",null,"SHSS",0.46,null,"Baggage Claim"]
["SHSS",null,"NR FlinFlon Medicine/Emergency",null,"IE Beausejour Medicine/Emerg",null,"PM Brandon Medicine ",null,null,null,null,null,"SS Portage Medicine/Pediatrics",null,"NRHA",0.504,null,"Parking"]
["PTNT_Above_53rd",null,"NR FlinFlon NorthernLightsMan",null,"IE Eriksdale PCH",null,"PM Brandon Surgery",null,null,null,null,null,"SS Portage Operating Room",null,"PTNT_Above_53rd",0.504,null,"Taxi/Uber"]
["PTNT_Below_53rd",null,"NR FlinFlon PersonalCareHome",null,"IE PineFalls Dialysis",null,"PM Dauphin Emerg",null,null,null,null,null,"SS Portage PostAnaethesia",null,"PTNT_Below_53rd",0.46,null,"Car Rental"]
[null,null,"NR Gillam Emergency Dept",null,"IE PineFalls Emergency/Medicine",null,"PM Dauphin Hemodialysis",null,null,null,null,null,"SS Portage Rehab",null,"Rate",null,null,"Car Rental Gas"]
[null,null,"NR Leaf Rapids Emergency Dept",null,"IE Selkirk Dialysis",null,"PM Dauphin Medicine",null,null,null,null,null,"SS Portage Surgery",null,"IERHA",60,null,"Other"]
[null,null,"NR Lynn Lake Medicine / Emerg",null,"IE Selkirk Emergency",null,"PM Dauphin Oncology",null,null,null,null,null,"SS Portage Obstetrics",null,"PMH",60]
[null,null,"NR Snow Lake Emergency Dept",null,"IE Selkirk Medicine",null,"PM Dauphin OR/PostAnaesthesia",null,null,null,null,null,"SS BoundTrails Cancer Care",null,"SHSS",60]
[null,null,"NR The Pas Amb Care Clinic",null,"IE Selkirk MedX",null,"PM Dauphin PCH",null,null,null,null,null,"SS BoundTrails Dialysis",null,"NRHA",65]
[null,null,"NR The Pas Cancer Care",null,"IE Selkirk Observation",null,"PM Dauphin Special Care Unit",null,null,null,null,null,"SS BoundTrails Emergency Dept",null,null,"  "]
[null,null,"NR The Pas Dialysis",null,"IE Stonewall Medicine/Emerg",null,"PM Dauphin Surgery",null,null,null,null,null,"SS BoundTrails Medicine "]
[null,null,"NR The Pas Emergency Dept",null,"IE Pinawa Medicine",null,"PM Gilb PlainsPersonalCareHome",null,null,null,null,null,"SS BoundTrails Operating Room",null,null,"Location","Breakfast","Lunch","Dinner","Incidentials"]
[null,null,"NR The Pas HC",null,"IE Whitemouth PCH",null,"PM Glenboro Med/Emerg",null,null,null,null,null,"SS BoundTrails PostAnaesthesia",null,null,"Below 53rd",10,14,26,10]
[null,null,"NR The Pas Medicine",null,"IE Berens River Dialysis",null,"PM Glenboro PCH",null,null,null,null,null,"SS BoundTrails Rehab",null,null,"Above 53rd",12,15,28,10]
[null,null,"NR The Pas Obstetrics / L&D",null,"IE Hodgson Dialysis",null,"PM Minnedosa Medicine/ Emerg",null,null,null,null,null,"SS BoundTrails Surgery"]
[null,null,"NR The Pas Operating Room",null,"PM Westman Nursing Home PCH",null,"PM Parkland Mental Health Center",null,null,null,null,null,"SS BoundTrails Obsetrics"]
[null,null,"NR The Pas Psychiatry",null,"IE Sunnywood PCH Pine Falls",null,"PM Swan River PCH",null,null,null,null,null,"SS Carmen Memorial Hospital Medicine"]
[null,null,"NR The Pas St. Paul's PCH",null,"IE Ashern PCH",null,"PM Swan Valley Lodge PCH",null,null,null,null,null,"SS Carman Operating Room",null,null,"2024-01-01",4.1666666666666664E-2,null,"Y"]
[null,null,"NR Thompson Dialysis",null,"IE East Gate Loge PCH Beausejour",null,"PM Brandon Dialysis",null,null,null,null,null,"SS Carman Same Day Surgery",null,null,"2030-12-31",1,null,"N"]
[null,null,"NR Thompson Emergency Dept",null,null,null,"PM Neepawa Chemo",null,null,null,null,null,"SS Notre Dame Med/Surg"]
[null,null,"NR Thompson Med/Surg/Peds",null,null,null,"PM Neepawa Medicine/Surgery",null,null,null,null,null,"SS Rock Lake Med/Surg"]
[null,null,"NR Thompson Northern Spirit Manor",null,null,null,"PM Neepawa PCH",null,null,null,null,null,"SS Carman Emergency Dept"]
[null,null,"NR Thompson Obstetrics/L&D",null,null,null,"PM Westman Nursing Home PCH",null,null,null,null,null,"SS Carman Post Anesthesia Care",null,null,"General Duty Nurse (N2)"]
[null,null,"NR Thompson Operating Room",null,null,null,null,null,null,null,null,null,null,null,null,"Licensed Practical Nurse"]
[null,null,"NR Thompson Psychiatry",null,null,null,null,null,null,null,null,null,null,null,null,"Registered Psychiatric Nurse (N2)"]
[null,null,"NR Thompson RAAM Eaglewood"]
[null,null,"NR Thompson CCC"]
[null,null,null,null,null,null,null,null,null,null,null,null,null,null,null,"Location","Breakfast","Lunch","Dinner","Incidentials"]
[null,null,null,null,null,null,null,null,null,null,null,null,null,null,null,"IERHA",10,14,26,10]
[null,null,null,null,null,null,null,null,null,null,null,null,null,null,null,"PMH",10,14,26,10]
[null,null,null,null,null,null,null,null,null,null,null,null,null,null,null,"SHSS",10,14,26,10]
[null,null,null,null,null,null,null,null,null,null,null,null,null,null,null,"NRHA",12,15,28,10]
[]
[null,null,null,null,null,null,null,null,null,null,null,null,null,null,null,"Clinical Day"]
[null,null,null,null,null,null,null,null,null,null,null,null,null,null,null,"Away for 24 Hours or more"]
[null,null,null,null,null,null,null,null,null,null,null,null,null,null,null,"Educational Day"]
[]
{"$rows_left_out":11}
{"sheet":"Sheet1","index":3,"n_rows":15,"n_cols":10,"rows_kept":15,"cut":false,"hidden":true,"merged":[]}
[]
[]
[]
[]
[]
[]
[]
[]
[]
[]
[null,null,null,null,null,null,"Location","Breakfast","Lunch","Dinner"]
[null,null,null,null,null,null,"IERHA",10,14,26]
[null,null,null,null,null,null,"PMH",10,14,26]
[null,null,null,null,null,null,"SH-SS",10,14,26]
[null,null,null,null,null,null,"NRHA",12,15,28]

{"sheet":"Per Diem","index":4,"n_rows":0,"n_cols":0,"rows_kept":0,"cut":false,"hidden":true,"merged":[]}

{"sheet":"Allowable Claim Items","index":5,"n_rows":0,"n_cols":0,"rows_kept":0,"cut":false,"hidden":true,"merged":[]}

{"sheet":"Cost Centre","index":6,"n_rows":106,"n_cols":4,"rows_kept":106,"cut":false,"hidden":false,"merged":[]}
[]
["ESP Long Name","Cost Ctr","SDO","ESP Long Name"]
["SHM - PrvFlPool",80600933,"PTNT","SHM - PrvFlPool"]
["NR Thompson Psychiatry",80800001,"NRHA","NR Thompson Psychiatry"]
["NR Thompson Obstetrics/L&D",80800002,"NRHA","NR Thompson Obstetrics/L&D"]
["NR Thompson Med/Surg/Peds",80800003,"NRHA","NR Thompson Med/Surg/Peds"]
["NR Thompson Emergency Dept",80800004,"NRHA","NR Thompson Emergency Dept"]
["NR Thompson Dialysis",80800005,"NRHA","NR Thompson Dialysis"]
["NR Thompson Operating Room",80800006,"NRHA","NR Thompson Operating Room"]
["NR FlinFlon CancerCare",80800007,"NRHA","NR FlinFlon CancerCare"]
["NR Thompson Northern Spirit Manor",80800008,"NRHA","NR Thompson Northern Spirit Manor"]
["NR The Pas Amb Care Clinic",80800009,"NRHA","NR The Pas Amb Care Clinic"]
["NR The Pas Dialysis",80800010,"NRHA","NR The Pas Dialysis"]
["NR The Pas Medicine",80800011,"NRHA","NR The Pas Medicine"]
["NR The Pas Obstetrics / L&D",80800012,"NRHA","NR The Pas Obstetrics / L&D"]
["NR The Pas Operating Room",80800013,"NRHA","NR The Pas Operating Room"]
["NR The Pas Emergency Dept",80800014,"NRHA","NR The Pas Emergency Dept"]
["NR The Pas Psychiatry",80800015,"NRHA","NR The Pas Psychiatry"]
["NR The Pas St. Paul's PCH",80800016,"NRHA","NR The Pas St. Paul's PCH"]
["NR The Pas HC",80800017,"NRHA","NR The Pas HC"]
["NR FlinFlon CancerCare",80800018,"NRHA","NR FlinFlon CancerCare"]
["NR FlinFlon Dialysis",80800019,"NRHA","NR FlinFlon Dialysis"]
["NR FlinFlon Medicine/Emergency",80800020,"NRHA","NR FlinFlon Medicine/Emergency"]
["NR FlinFlon Medicine/Emergency",80800021,"NRHA","NR FlinFlon Medicine/Emergency"]
["NR FlinFlon NorthernLightsMan",80800022,"NRHA","NR FlinFlon NorthernLightsMan"]
["NR FlinFlon PersonalCareHome",80800023,"NRHA","NR FlinFlon PersonalCareHome"]
["NR Flin Flon Home Care",80800024,"NRHA","NR Flin Flon Home Care"]
["NR Snow Lake Emergency Dept",80800026,"NRHA","NR Snow Lake Emergency Dept"]
["NR Gillam Emergency Dept",80800027,"NRHA","NR Gillam Emergency Dept"]
["NR Gillam Emergency Dept",80800028,"NRHA","NR Gillam Emergency Dept"]
["NR Lynn Lake Medicine / Emerg",80800029,"NRHA","NR Lynn Lake Medicine / Emerg"]
["NR Lynn Lake Medicine / Emerg",80800030,"NRHA","NR Lynn Lake Medicine / Emerg"]
["NR Leaf Rapids Emergency Dept",80800031,"NRHA","NR Leaf Rapids Emergency Dept"]
["IE PineFalls Dialysis",80800032,"IERHA","IE PineFalls Dialysis"]
["IE PineFalls Emergency/Medicine",80800033,"IERHA","IE PineFalls Emergency/Medicine"]
["IE Ashern Emergency",80800035,"IERHA","IE Ashern Emergency"]
["IE Ashern Medicine",80800036,"IERHA","IE Ashern Medicine"]
["IE Ashern Dialysis",80800037,"IERHA","IE Ashern Dialysis"]
["IE Beausejour Medicine/Emerg",80800038,"IERHA","IE Beausejour Medicine/Emerg"]
["IE Stonewall Medicine/Emerg",80800040,"IERHA","IE Stonewall Medicine/Emerg"]
{"$rows_left_out":67}
{"sheet":"Expense Code","index":7,"n_rows":9,"n_cols":2,"rows_kept":9,"cut":false,"hidden":true,"merged":[]}
[]
[]
[562310000,"Staff Travel Local"]
[562312000,"Staff Travel Provincial"]
[562314000,"Staff Travel (Outside Manitoba)"]
[562320002,"Staff Travel Service Recipient-Related Parking"]
[562300005,"Travel Operations Meals"]
[562310002,"Staff Travel Local - MNU Mileage Allowance"]
[562300000,"TRAVEL EXP - STAFF"]

{"sheet":"Follow-up","index":8,"n_rows":15,"n_cols":4,"rows_kept":15,"cut":false,"hidden":true,"merged":[]}
[]
[null,"Item","Change","Status"]
[null,1,"Larger font and wrap text","Complete"]
[null,2,"For the Employee Signature, please change to have the employee type in their name and format the font to be in a legible script font.  Can add a comment something like “By typing your name in the above field, you are stating that you are aware of this claim being submitted by you as the Claimant.”","Complete"]
[null,3,"In the Mileage section, is it possible to interchange the columns, so that input for Trip information will be the starting point like Home or any other Address, and the Facility assignment will be destination (Facility assigned to). Perhaps change names to something like From and To Destination respectively.","Please Review"]
[null,4,"Formula in Mileage Total is not picking up all the cells – missing cells L21 to L30 in the formula","Complete"]
[null,5,"Drop downs in the Per Diem – Travel Day do not appear to be working.  Also “Page 1” is appearing in the form in this section ","Changed to Normal View from Page Break View; Location and Facility needs to be selected for drop down to populate -  Complete"]
[null,6,"Can the following be added in the drop down list for Other:","Complete"]
[null,null,"Taxi/Uber"]
[null,null,"Car Rental"]
[null,null,"Car Rental Gas"]
[null,7,"For the “Other” selection in this section, there should be a cell to populate what the actual charge is.","Need more information"]
[null,8,"Shared Health logo should be at the top of the page – perhaps in the header","Complete"]
[null,9,"AP was hoping there would be a summary section that would summarize the coding and charges be cost centre and expense code.  Not sure how to build a formula to do that though.  It would mean that AP would have to manually calculate the totals by cost centre/expense code or enter each line separately.  More work for AP, but that may have to be the way it is as we don’t want to eliminate any of the built in features in the new claim.  Open to discuss.","Complete"]
[null,10,"Approver sign the form","Complete"]